Reaction Details
TargetVascular endothelial growth factor receptor 2
LigandBDBM50337797
Substrate/Competitorn/a
Meas. Tech.ChEMBL_726802 (CHEMBL1686402)
Ki 8±n/a nM
Citation Kawakami, JKMartinez, YSasaki, BHarris, MKurata, WELau, AF Investigation of a novel molecular descriptor for the lead optimization of 4-aminoquinazolines as vascular endothelial growth factor receptor-2 inhibitors: application for quantitative structure-activity relationship analysis in lead optimization. Bioorg Med Chem Lett21:1371-5 (2011) 
 
Vascular endothelial growth factor receptor 2
Name:Vascular endothelial growth factor receptor 2
Type:Receptor Tyrosine Kinase
Mol. Mass.:151510.97
Organism:Homo sapiens (Human)
Description:P35968
Residue:1356
BDBM50337797
NameBDBM50337797
Synonyms:(6aR,10aR)-3-(5-bromopentyl)-6,6,9-trimethyl-6a,7,10,10a-tetrahydro-6H-benzo[c]chromen-1-ol | CHEMBL1683647
TypeSmall organic molecule
Emp. Form.C21H29BrO2
Mol. Mass.393.358
SMILESCC1=CC[C@@H]2[C@@H](C1)c1c(O)cc(CCCCCBr)cc1OC2(C)C