Reaction Details
TargetVascular endothelial growth factor receptor 2
LigandBDBM50171391
Substrate/Competitorn/a
Meas. Tech.ChEMBL_726802 (CHEMBL1686402)
Ki 818±n/a nM
Citation Kawakami, JKMartinez, YSasaki, BHarris, MKurata, WELau, AF Investigation of a novel molecular descriptor for the lead optimization of 4-aminoquinazolines as vascular endothelial growth factor receptor-2 inhibitors: application for quantitative structure-activity relationship analysis in lead optimization. Bioorg Med Chem Lett21:1371-5 (2011) 
 
Vascular endothelial growth factor receptor 2
Name:Vascular endothelial growth factor receptor 2
Type:Receptor Tyrosine Kinase
Mol. Mass.:151510.97
Organism:Homo sapiens (Human)
Description:P35968
Residue:1356
BDBM50171391
NameBDBM50171391
Synonyms:2-Heptyl-2H-pyrazolo[3,4-d]pyrimidin-4-ylamine | CHEMBL426443
TypeSmall organic molecule
Emp. Form.C12H19N5
Mol. Mass.233.3128
SMILESCCCCCCCn1cc2c(N)ncnc2n1