Reaction Details
TargetVascular endothelial growth factor receptor 2
LigandBDBM50171395
Substrate/Competitorn/a
Meas. Tech.ChEMBL_726802 (CHEMBL1686402)
Ki 0.47±n/a nM
Citation Kawakami, JKMartinez, YSasaki, BHarris, MKurata, WELau, AF Investigation of a novel molecular descriptor for the lead optimization of 4-aminoquinazolines as vascular endothelial growth factor receptor-2 inhibitors: application for quantitative structure-activity relationship analysis in lead optimization. Bioorg Med Chem Lett21:1371-5 (2011) 
 
Vascular endothelial growth factor receptor 2
Name:Vascular endothelial growth factor receptor 2
Type:Receptor Tyrosine Kinase
Mol. Mass.:151510.97
Organism:Homo sapiens (Human)
Description:P35968
Residue:1356
BDBM50171395
NameBDBM50171395
Synonyms:2-Undecyl-2H-pyrazolo[3,4-d]pyrimidin-4-ylamine | CHEMBL190495
TypeSmall organic molecule
Emp. Form.C16H27N5
Mol. Mass.289.4191
SMILESCCCCCCCCCCCn1cc2c(N)ncnc2n1