Reaction Details
TargetVascular endothelial growth factor receptor 2
LigandBDBM50171396
Substrate/Competitorn/a
Meas. Tech.ChEMBL_726802 (CHEMBL1686402)
Ki 0.28±n/a nM
Citation Kawakami, JKMartinez, YSasaki, BHarris, MKurata, WELau, AF Investigation of a novel molecular descriptor for the lead optimization of 4-aminoquinazolines as vascular endothelial growth factor receptor-2 inhibitors: application for quantitative structure-activity relationship analysis in lead optimization. Bioorg Med Chem Lett21:1371-5 (2011) 
 
Vascular endothelial growth factor receptor 2
Name:Vascular endothelial growth factor receptor 2
Type:Receptor Tyrosine Kinase
Mol. Mass.:151510.97
Organism:Homo sapiens (Human)
Description:P35968
Residue:1356
BDBM50171396
NameBDBM50171396
Synonyms:1-((R)-4-Amino-pyrazolo[3,4-d]pyrimidin-2-yl)-decan-2-ol | CHEMBL190239
TypeSmall organic molecule
Emp. Form.C15H25N5O
Mol. Mass.291.3919
SMILESCCCCCCCCC(O)Cn1cc2c(N)ncnc2n1