Reaction Details
TargetMetabotropic glutamate receptor 5
LigandBDBM50337960
Substrate/Competitorn/a
Meas. Tech.ChEMBL_727149 (CHEMBL1687120)
IC50 660±n/a nM
Citation Williams, RManka, JTRodriguez, ALVinson, PNNiswender, CMWeaver, CDJones, CKConn, PJLindsley, CWStauffer, SR Synthesis and SAR of centrally active mGlu5 positive allosteric modulators based on an aryl acetylenic bicyclic lactam scaffold. Bioorg Med Chem Lett21:1350-3 (2011) 
 
Metabotropic glutamate receptor 5
Name:Metabotropic glutamate receptor 5
Type:Enzyme
Mol. Mass.:132484.72
Organism:Homo sapiens (Human)
Description:n/a
Residue:1212
BDBM50337960
NameBDBM50337960
Synonyms:6-(cyclopropylmethyl)-2-((3-fluorophenyl)ethynyl)-7,8-dihydro-1,6-naphthyridin-5(6H)-one | CHEMBL1684231
TypeSmall organic molecule
Emp. Form.C20H17FN2O
Mol. Mass.320.3602
SMILESFc1cccc(c1)C#Cc1ccc2C(=O)N(CC3CC3)CCc2n1