Reaction Details
TargetTransient receptor potential cation channel subfamily V member 1
LigandBDBM50337975
Substrate/Competitorn/a
Meas. Tech.ChEMBL_727155 (CHEMBL1687126)
IC50 8±n/a nM
Citation Schmidt, RGBayburt, EKLatshaw, SPKoenig, JRDaanen, JFMcDonald, HABianchi, BRZhong, CJoshi, SHonore, PMarsh, KCLee, CHFaltynek, CRGomtsyan, A Chroman and tetrahydroquinoline ureas as potent TRPV1 antagonists. Bioorg Med Chem Lett21:1338-41 (2011) 
 
Transient receptor potential cation channel subfamily V member 1
Name:Transient receptor potential cation channel subfamily V member 1
Type:Protein
Mol. Mass.:94960.75
Organism:Homo sapiens (Human)
Description:Q8NER1
Residue:839
BDBM50337975
NameBDBM50337975
Synonyms:1-(1H-indazol-4-yl)-3-(7-(trifluoromethoxy)chroman-4-yl)urea | CHEMBL1684251
TypeSmall organic molecule
Emp. Form.C18H15F3N4O3
Mol. Mass.392.3319
SMILESFC(F)(F)Oc1ccc2C(CCOc2c1)NC(=O)Nc1cccc2[nH]ncc12