Reaction Details
TargetTyrosine-protein kinase ITK/TSK
LigandBDBM50338045
Substrate/Competitorn/a
Meas. Tech.ChEMBL_727521 (CHEMBL1685631)
IC50 87±n/a nM
Citation Herdemann, MWeber, AJonveaux, JSchwoebel, FStoeck, MHeit, I Optimisation of ITK inhibitors through successive iterative design cycles. Bioorg Med Chem Lett21:1852-6 (2011) 
 
Tyrosine-protein kinase ITK/TSK
Name:Tyrosine-protein kinase ITK/TSK
Type:Protein
Mol. Mass.:71839.20
Organism:Homo sapiens (Human)
Description:Q08881
Residue:620
BDBM50338045
NameBDBM50338045
Synonyms:CHEMBL1684508 | N-(3-(6-methoxy-1H-indol-2-yl)-1H-indazol-5-yl)acetamide
TypeSmall organic molecule
Emp. Form.C18H16N4O2
Mol. Mass.320.3452
SMILESCOc1ccc2cc([nH]c2c1)-c1n[nH]c2ccc(NC(C)=O)cc12