Reaction Details
TargetTyrosine-protein kinase ITK/TSK
LigandBDBM50338050
Substrate/Competitorn/a
Meas. Tech.ChEMBL_727521 (CHEMBL1685631)
IC50 69±n/a nM
Citation Herdemann, MWeber, AJonveaux, JSchwoebel, FStoeck, MHeit, I Optimisation of ITK inhibitors through successive iterative design cycles. Bioorg Med Chem Lett21:1852-6 (2011) 
 
Tyrosine-protein kinase ITK/TSK
Name:Tyrosine-protein kinase ITK/TSK
Type:Protein
Mol. Mass.:71839.20
Organism:Homo sapiens (Human)
Description:Q08881
Residue:620
BDBM50338050
NameBDBM50338050
Synonyms:CHEMBL1684517 | N-(3-(6-methyl-1H-indol-2-yl)-1H-indazol-5-yl)benzenesulfonamide
TypeSmall organic molecule
Emp. Form.C22H18N4O2S
Mol. Mass.402.469
SMILESCc1ccc2cc([nH]c2c1)-c1n[nH]c2ccc(NS(=O)(=O)c3ccccc3)cc12