Reaction Details
TargetTyrosine-protein kinase ITK/TSK
LigandBDBM50338070
Substrate/Competitorn/a
Meas. Tech.ChEMBL_727521 (CHEMBL1685631)
IC50 120±n/a nM
Citation Herdemann, MWeber, AJonveaux, JSchwoebel, FStoeck, MHeit, I Optimisation of ITK inhibitors through successive iterative design cycles. Bioorg Med Chem Lett21:1852-6 (2011) 
 
Tyrosine-protein kinase ITK/TSK
Name:Tyrosine-protein kinase ITK/TSK
Type:Protein
Mol. Mass.:71839.20
Organism:Homo sapiens (Human)
Description:Q08881
Residue:620
BDBM50338070
NameBDBM50338070
Synonyms:4-(2-(1H-indazol-3-yl)-1H-indol-6-yl)morpholine | CHEMBL1684672
TypeSmall organic molecule
Emp. Form.C19H18N4O
Mol. Mass.318.3724
SMILESC1CN(CCO1)c1ccc2cc([nH]c2c1)-c1n[nH]c2ccccc12