Reaction Details
TargetTyrosine-protein kinase ITK/TSK
LigandBDBM50338076
Substrate/Competitorn/a
Meas. Tech.ChEMBL_727521 (CHEMBL1685631)
IC50 70±n/a nM
Citation Herdemann, MWeber, AJonveaux, JSchwoebel, FStoeck, MHeit, I Optimisation of ITK inhibitors through successive iterative design cycles. Bioorg Med Chem Lett21:1852-6 (2011) 
 
Tyrosine-protein kinase ITK/TSK
Name:Tyrosine-protein kinase ITK/TSK
Type:Protein
Mol. Mass.:71839.20
Organism:Homo sapiens (Human)
Description:Q08881
Residue:620
BDBM50338076
NameBDBM50338076
Synonyms:2-(1H-indazol-3-yl)-N-(2-methoxyethyl)-N-methyl-1H-indole-6-carboxamide | CHEMBL1684678
TypeSmall organic molecule
Emp. Form.C20H20N4O2
Mol. Mass.348.3984
SMILESCOCCN(C)C(=O)c1ccc2cc([nH]c2c1)-c1n[nH]c2ccccc12