Reaction Details
TargetTyrosine-protein kinase ITK/TSK
LigandBDBM50338077
Substrate/Competitorn/a
Meas. Tech.ChEMBL_727521 (CHEMBL1685631)
IC50 20±n/a nM
Citation Herdemann, MWeber, AJonveaux, JSchwoebel, FStoeck, MHeit, I Optimisation of ITK inhibitors through successive iterative design cycles. Bioorg Med Chem Lett21:1852-6 (2011) 
 
Tyrosine-protein kinase ITK/TSK
Name:Tyrosine-protein kinase ITK/TSK
Type:Protein
Mol. Mass.:71839.20
Organism:Homo sapiens (Human)
Description:Q08881
Residue:620
BDBM50338077
NameBDBM50338077
Synonyms:2-(1H-indazol-3-yl)-N-isobutyl-N-methyl-1H-indole-6-carboxamide | CHEMBL1684679
TypeSmall organic molecule
Emp. Form.C21H22N4O
Mol. Mass.346.4256
SMILESCC(C)CN(C)C(=O)c1ccc2cc([nH]c2c1)-c1n[nH]c2ccccc12