Reaction Details
TargetTyrosine-protein kinase ITK/TSK
LigandBDBM50338100
Substrate/Competitorn/a
Meas. Tech.ChEMBL_727521 (CHEMBL1685631)
IC50 23±n/a nM
Citation Herdemann, MWeber, AJonveaux, JSchwoebel, FStoeck, MHeit, I Optimisation of ITK inhibitors through successive iterative design cycles. Bioorg Med Chem Lett21:1852-6 (2011) 
 
Tyrosine-protein kinase ITK/TSK
Name:Tyrosine-protein kinase ITK/TSK
Type:Protein
Mol. Mass.:71839.20
Organism:Homo sapiens (Human)
Description:Q08881
Residue:620
BDBM50338100
NameBDBM50338100
Synonyms:CHEMBL1684543 | N-(1-benzylpiperidin-4-yl)-3-(6-methyl-1H-indol-2-yl)-1H-indazol-5-amine
TypeSmall organic molecule
Emp. Form.C28H29N5
Mol. Mass.435.5634
SMILESCc1ccc2cc([nH]c2c1)-c1n[nH]c2ccc(NC3CCN(Cc4ccccc4)CC3)cc12