Reaction Details
TargetAndrogen receptor
LigandBDBM18161
Substrate/Competitorn/a
Meas. Tech.ChEMBL_726892 (CHEMBL1686598)
IC50 3.1±n/a nM
Citation Nagata, NMiyakawa, MAmano, SFuruya, KYamamoto, NInoguchi, K Design and synthesis of tricyclic tetrahydroquinolines as a new series of nonsteroidal selective androgen receptor modulators (SARMs). Bioorg Med Chem Lett21:1744-7 (2011) 
 
Androgen receptor
Name:Androgen receptor
Type:Enzyme
Mol. Mass.:98219.08
Organism:Rattus norvegicus (Rat)
Description:P15207
Residue:902
BDBM18161
NameBDBM18161
Synonyms:(1S,2S,7S,10R,11S,14S,15S)-14-hydroxy-2,15-dimethyltetracyclo[8.7.0.0^{2,7}.0^{11,15}]heptadecan-5-one CHEMBL27769 Dihydrotestosterone | [3H]DHT
TypeSteroid
Emp. Form.C19H30O2
Mol. Mass.290.4403
SMILES[H][C@@]12CC[C@H](O)[C@@]1(C)CC[C@@]1([H])[C@@]2([H])CC[C@@]2([H])CC(=O)CC[C@]12C