Reaction Details
TargetRho-associated protein kinase 2
LigandBDBM50338714
Substrate/Competitorn/a
Meas. Tech.ChEMBL_726899 (CHEMBL1686688)
IC50 2±n/a nM
Citation Fang, XChen, YTSessions, EHChowdhury, SVojkovsky, TYin, YPocas, JRGrant, WSchröter, TLin, LRuiz, CCameron, MDLoGrasso, PBannister, TDFeng, Y Synthesis and biological evaluation of 4-quinazolinones as Rho kinase inhibitors. Bioorg Med Chem Lett21:1844-8 (2011) 
 
Rho-associated protein kinase 2
Name:Rho-associated protein kinase 2
Type:Protein
Mol. Mass.:160885.43
Organism:Homo sapiens (Human)
Description:O75116
Residue:1388
BDBM50338714
NameBDBM50338714
Synonyms:8-methoxy-2-(6-methoxychroman-3-yl)-6-(1H-pyrazol-4-yl)quinazolin-4(3H)-one | CHEMBL1684221
TypeSmall organic molecule
Emp. Form.C22H20N4O4
Mol. Mass.404.4186
SMILESCOc1ccc2OCC(Cc2c1)c1nc2c(OC)cc(cc2c(=O)[nH]1)-c1cn[nH]c1