Reaction Details
TargetBroad substrate specificity ATP-binding cassette transporter ABCG2
LigandBDBM32628
Substrate/Competitorn/a
Meas. Tech.ChEMBL_735838 (CHEMBL1694230)
IC50 800±n/a nM
Citation Versiani, MADiyabalanage, TRatnayake, RHenrich, CJBates, SEMcMahon, JBGustafson, KR Flavonoids from eight tropical plant species that inhibit the multidrug resistance transporter ABCG2. J Nat Prod74:262-6 (2011) 
 
Broad substrate specificity ATP-binding cassette transporter ABCG2
Name:Broad substrate specificity ATP-binding cassette transporter ABCG2
Type:Multi-pass membrane protein; monomer or homodimer; disulfide-linked
Mol. Mass.:72329.48
Organism:Homo sapiens (Human)
Description:Q9UNQ0
Residue:655
BDBM32628
NameBDBM32628
Synonyms:FTC | Fumitremorgin C
TypeSmall organic molecule
Emp. Form.C22H25N3O3
Mol. Mass.379.4522
SMILES[H][C@@]12CCCN1C(=O)[C@]1([H])Cc3c([nH]c4cc(OC)ccc34)[C@H](C=C(C)C)N1C2=O