Reaction Details
TargetProtein Mdm4
LigandBDBM50339163
Substrate/Competitorn/a
Meas. Tech.ChEMBL_735890 (CHEMBL1694394)
IC50 220±n/a nM
Citation Madden, MMMuppidi, ALi, ZLi, XChen, JLin, Q Synthesis of cell-permeable stapled peptide dual inhibitors of the p53-Mdm2/Mdmx interactions via photoinduced cycloaddition. Bioorg Med Chem Lett21:1472-5 (2011) 
 
Protein Mdm4
Name:Protein Mdm4
Type:Oncoprotein
Mol. Mass.:54842.04
Organism:Homo sapiens (Human)
Description:The HDMX(1-188) were expressed in Escherichia coli BL21 (DE3) as a GST fusion and purified on glutathione sepharose.
Residue:490
BDBM50339163
NameBDBM50339163
Synonyms:CHEMBL1689395 | N-((4S,7S,10S,13S,16S,19S,22S,25S)-16-((1H-imidazol-5-yl)methyl)-22-((1H-indol-3-yl)methyl)-10-benzyl-25-((6S,9S,12S,15S)-1,16-diamino-12-((R)-1-hydroxyethyl)-15-(hydroxymethyl)-1-imino-9-isobutyl-7,10,13,16-tetraoxo-2,8,11,14-tetraazahexadecan-6-ylcarbamoyl)-19-(4-hydroxybenzyl)-7-((R)-1-hydroxyethyl)-4-isobutyl-13-(4-methacrylamidobutyl)-2,5,8,11,14,17,20,23-octaoxo-3,6,9,12,15,18,21,24-octaazanonacosan-29-yl)-2-(4-methoxyphenyl)-2H-tetrazole-5-carboxamide
TypeSmall organic molecule
Emp. Form.C91H127N25O20
Mol. Mass.1891.1376
SMILESCOc1ccc(cc1)-n1nnc(n1)C(=O)NCCCC[C@H](NC(=O)[C@H](Cc1c[nH]c2ccccc12)NC(=O)[C@H](Cc1ccc(O)cc1)NC(=O)[C@H](Cc1cnc[nH]1)NC(=O)[C@H](CCCCNC(=O)C(C)=C)NC(=O)[C@H](Cc1ccccc1)NC(=O)[C@@H](NC(=O)[C@H](CC(C)C)NC(C)=O)[C@@H](C)O)C(=O)N[C@@H](CCCN=C(N)N)C(=O)N[C@@H](CC(C)C)C(=O)N[C@@H]([C@@H](C)O)C(=O)N[C@@H](CO)C(N)=O