Reaction Details
TargetProtein Mdm4
LigandBDBM50339176
Substrate/Competitorn/a
Meas. Tech.ChEMBL_735890 (CHEMBL1694394)
IC50 100±n/a nM
Citation Madden, MMMuppidi, ALi, ZLi, XChen, JLin, Q Synthesis of cell-permeable stapled peptide dual inhibitors of the p53-Mdm2/Mdmx interactions via photoinduced cycloaddition. Bioorg Med Chem Lett21:1472-5 (2011) 
 
Protein Mdm4
Name:Protein Mdm4
Type:Oncoprotein
Mol. Mass.:54842.04
Organism:Homo sapiens (Human)
Description:The HDMX(1-188) were expressed in Escherichia coli BL21 (DE3) as a GST fusion and purified on glutathione sepharose.
Residue:490
BDBM50339176
NameBDBM50339176
Synonyms:CHEMBL1689406
TypeSmall organic molecule
Emp. Form.C76H108N18O19
Mol. Mass.1577.7799
SMILESCC(C)C[C@H](NC(C)=O)C(=O)N[C@@H]([C@@H](C)O)C(=O)N[C@@H](Cc1ccccc1)C(=O)N[C@@H](CCCCNC(C)=O)C(=O)N[C@@H](Cc1cnc[nH]1)C(=O)N[C@@H](Cc1ccc(O)cc1)C(=O)N[C@@H](Cc1c[nH]c2ccccc12)C(=O)N[C@@H](C)C(=O)N[C@@H](CCC(N)=O)C(=O)N[C@@H](CC(C)C)C(=O)N[C@@H]([C@@H](C)O)C(=O)N[C@@H](CO)C(N)=O