Reaction Details
TargetProtein Mdm4
LigandBDBM50339174
Substrate/Competitorn/a
Meas. Tech.ChEMBL_735890 (CHEMBL1694394)
IC50 282±n/a nM
Citation Madden, MMMuppidi, ALi, ZLi, XChen, JLin, Q Synthesis of cell-permeable stapled peptide dual inhibitors of the p53-Mdm2/Mdmx interactions via photoinduced cycloaddition. Bioorg Med Chem Lett21:1472-5 (2011) 
 
Protein Mdm4
Name:Protein Mdm4
Type:Oncoprotein
Mol. Mass.:54842.04
Organism:Homo sapiens (Human)
Description:The HDMX(1-188) were expressed in Escherichia coli BL21 (DE3) as a GST fusion and purified on glutathione sepharose.
Residue:490
BDBM50339174
NameBDBM50339174
Synonyms:(2S,5S,8S,11S,14S,17S,20S,23S,26S)-17-((1H-indol-3-yl)methyl)-26-((S)-2-((2S,3R)-2-((S)-2-acetamido-4-methylpentanamido)-3-hydroxybutanamido)-3-phenylpropanamido)-23-(4-acetamidobutyl)-1-amino-11-(3-amino-3-oxopropyl)-20-(4-hydroxybenzyl)-5-((R)-1-hydroxyethyl)-2-(hydroxymethyl)-8-isobutyl-14-methyl-1,4,7,10,13,16,19,22,25-nonaoxo-3,6,9,12,15,18,21,24-octaazanonacosan-29-oic acid | CHEMBL1689407
TypeSmall organic molecule
Emp. Form.C75H108N16O21
Mol. Mass.1569.7546
SMILESCC(C)C[C@H](NC(C)=O)C(=O)N[C@@H]([C@@H](C)O)C(=O)N[C@@H](Cc1ccccc1)C(=O)N[C@@H](CCC(O)=O)C(=O)N[C@@H](CCCCNC(C)=O)C(=O)N[C@@H](Cc1ccc(O)cc1)C(=O)N[C@@H](Cc1c[nH]c2ccccc12)C(=O)N[C@@H](C)C(=O)N[C@@H](CCC(N)=O)C(=O)N[C@@H](CC(C)C)C(=O)N[C@@H]([C@@H](C)O)C(=O)N[C@@H](CO)C(N)=O