Reaction Details
TargetCarbonic anhydrase 2
LigandBDBM50216276
Substrate/Competitorn/a
Meas. Tech.ChEMBL_736727 (CHEMBL1695108)
Ki 230000±n/a nM
Citation Davis, RAHofmann, AOsman, AHall, RAMühlschlegel, FAVullo, DInnocenti, ASupuran, CTPoulsen, SA Natural product-based phenols as novel probes for mycobacterial and fungal carbonic anhydrases. J Med Chem54:1682-92 (2011) 
 
Carbonic anhydrase 2
Name:Carbonic anhydrase 2
Type:Enzyme
Mol. Mass.:29250.71
Organism:Homo sapiens (Human)
Description:P00918
Residue:260
BDBM50216276
NameBDBM50216276
Synonyms:(-)-dihydroguaiaretic acid CHEMBL375927
TypeSmall organic molecule
Emp. Form.C20H26O4
Mol. Mass.330.418
SMILESCOc1cc(C[C@@H](C)[C@H](C)Cc2ccc(O)c(OC)c2)ccc1O