Reaction Details
TargetCarbonic anhydrase 2
LigandBDBM50339601
Substrate/Competitorn/a
Meas. Tech.ChEMBL_736727 (CHEMBL1695108)
Ki 18±n/a nM
Citation Davis, RAHofmann, AOsman, AHall, RAMühlschlegel, FAVullo, DInnocenti, ASupuran, CTPoulsen, SA Natural product-based phenols as novel probes for mycobacterial and fungal carbonic anhydrases. J Med Chem54:1682-92 (2011) 
 
Carbonic anhydrase 2
Name:Carbonic anhydrase 2
Type:Enzyme
Mol. Mass.:29250.71
Organism:Homo sapiens (Human)
Description:P00918
Residue:260
BDBM50339601
NameBDBM50339601
Synonyms:2-(3-chloro-4-hydroxyphenyl)-N-(4-sulfamoylphenethyl)acetamide CHEMBL606453
TypeSmall organic molecule
Emp. Form.C16H17ClN2O4S
Mol. Mass.368.835
SMILESNS(=O)(=O)c1ccc(CCNC(=O)Cc2ccc(O)c(Cl)c2)cc1