Reaction Details
TargetCarbonic anhydrase 2
LigandBDBM50339602
Substrate/Competitorn/a
Meas. Tech.ChEMBL_736727 (CHEMBL1695108)
Ki 10400±n/a nM
Citation Davis, RAHofmann, AOsman, AHall, RAMühlschlegel, FAVullo, DInnocenti, ASupuran, CTPoulsen, SA Natural product-based phenols as novel probes for mycobacterial and fungal carbonic anhydrases. J Med Chem54:1682-92 (2011) 
 
Carbonic anhydrase 2
Name:Carbonic anhydrase 2
Type:Enzyme
Mol. Mass.:29250.71
Organism:Homo sapiens (Human)
Description:P00918
Residue:260
BDBM50339602
NameBDBM50339602
Synonyms:2-(3-chloro-4-hydroxyphenyl)-N-(2-methoxyethyl)acetamide | CHEMBL588491
TypeSmall organic molecule
Emp. Form.C11H14ClNO3
Mol. Mass.243.687
SMILESCOCCNC(=O)Cc1ccc(O)c(Cl)c1