Reaction Details
TargetCarbonic anhydrase
LigandBDBM50339599
Substrate/Competitorn/a
Meas. Tech.ChEMBL_736722 (CHEMBL1695103)
Ki 910±n/a nM
Citation Davis, RAHofmann, AOsman, AHall, RAMühlschlegel, FAVullo, DInnocenti, ASupuran, CTPoulsen, SA Natural product-based phenols as novel probes for mycobacterial and fungal carbonic anhydrases. J Med Chem54:1682-92 (2011) 
 
Carbonic anhydrase
Name:Carbonic anhydrase
Synonyms:PROBABLE TRANSMEMBRANE CARBONIC ANHYDRASE (CARBONATE DEHYDRATASE) (CARBONIC DEHYDRATASE)
Type:PROTEIN
Mol. Mass.:80567.22
Organism:Mycobacterium tuberculosis
Description:ChEMBL_878775
Residue:764
BDBM50339599
NameBDBM50339599
TypeSmall organic molecule
Emp. Form.C17H18ClNO3
Mol. Mass.319.783
SMILESCOc1cccc(CCNC(=O)Cc2ccc(O)c(Cl)c2)c1