Reaction Details
TargetCarbonic anhydrase
LigandBDBM50339604
Substrate/Competitorn/a
Meas. Tech.ChEMBL_736724 (CHEMBL1695105)
Ki 810±n/a nM
Citation Davis, RAHofmann, AOsman, AHall, RAMühlschlegel, FAVullo, DInnocenti, ASupuran, CTPoulsen, SA Natural product-based phenols as novel probes for mycobacterial and fungal carbonic anhydrases. J Med Chem54:1682-92 (2011) 
 
Carbonic anhydrase
Name:Carbonic anhydrase
Type:Enzyme
Mol. Mass.:31587.59
Organism:Candida albicans (Yeast)
Description:n/a
Residue:281
BDBM50339604
NameBDBM50339604
Synonyms:CHEMBL605189 | N-butyl-2-(3-chloro-4-hydroxyphenyl)acetamide
TypeSmall organic molecule
Emp. Form.C12H16ClNO2
Mol. Mass.241.714
SMILESCCCCNC(=O)Cc1ccc(O)c(Cl)c1