Reaction Details
TargetCarbonic anhydrase
LigandBDBM50216277
Substrate/Competitorn/a
Meas. Tech.ChEMBL_736725 (CHEMBL1695106)
Ki 770±n/a nM
Citation Davis, RAHofmann, AOsman, AHall, RAMühlschlegel, FAVullo, DInnocenti, ASupuran, CTPoulsen, SA Natural product-based phenols as novel probes for mycobacterial and fungal carbonic anhydrases. J Med Chem54:1682-92 (2011) 
 
Carbonic anhydrase
Name:Carbonic anhydrase
Synonyms:Carbonic Anhydrase 2 (Can2)
Type:Enzyme
Mol. Mass.:26594.37
Organism:Cryptococcus neoformans var. grubii (Filobasidiella neoformans var. grubii)
Description:n/a
Residue:239
BDBM50216277
NameBDBM50216277
TypeSmall organic molecule
Emp. Form.C20H24O4
Mol. Mass.328.4022
SMILESCOc1cc(ccc1O)[C@@H]1[C@@H](C)[C@H](C)[C@H]1c1ccc(O)c(OC)c1