Reaction Details
TargetBeta-carbonic anhydrase 1
LigandBDBM50339592
Substrate/Competitorn/a
Meas. Tech.ChEMBL_736723 (CHEMBL1695104)
Ki 11800±n/a nM
Citation Davis, RAHofmann, AOsman, AHall, RAMühlschlegel, FAVullo, DInnocenti, ASupuran, CTPoulsen, SA Natural product-based phenols as novel probes for mycobacterial and fungal carbonic anhydrases. J Med Chem54:1682-92 (2011) 
 
Beta-carbonic anhydrase 1
Name:Beta-carbonic anhydrase 1
Type:Enzyme
Mol. Mass.:18186.06
Organism:Mycobacterium tuberculosis
Description:The recombinant GST-mtCA1 construct was cloned, expressed, and further purified from E. coli. The purified protein was used in inhibition assays.
Residue:163
BDBM50339592
NameBDBM50339592
Synonyms:2-amino-4-(4-hydroxy-3-methoxybenzylidene)-1H-imidazol-5(4H)-one | CHEMBL603189
TypeSmall organic molecule
Emp. Form.C11H11N3O3
Mol. Mass.233.2233
SMILESCOc1cc(C=C2N=C(N)NC2=O)ccc1O