Reaction Details
TargetBeta-carbonic anhydrase 1
LigandBDBM50339596
Substrate/Competitorn/a
Meas. Tech.ChEMBL_736723 (CHEMBL1695104)
Ki 800±n/a nM
Citation Davis, RAHofmann, AOsman, AHall, RAMühlschlegel, FAVullo, DInnocenti, ASupuran, CTPoulsen, SA Natural product-based phenols as novel probes for mycobacterial and fungal carbonic anhydrases. J Med Chem54:1682-92 (2011) 
 
Beta-carbonic anhydrase 1
Name:Beta-carbonic anhydrase 1
Type:Enzyme
Mol. Mass.:18186.06
Organism:Mycobacterium tuberculosis
Description:The recombinant GST-mtCA1 construct was cloned, expressed, and further purified from E. coli. The purified protein was used in inhibition assays.
Residue:163
BDBM50339596
NameBDBM50339596
Synonyms:4,4'-((1R,2S,3R,4S)-3,4-dimethylcyclobutane-1,2-diyl)bis(2-methoxyphenol) CHEMBL517222 | endiandrin B
TypeSmall organic molecule
Emp. Form.C20H24O4
Mol. Mass.328.4022
SMILESCOc1cc(ccc1O)[C@H]1[C@H](C)[C@H](C)[C@H]1c1ccc(O)c(OC)c1