Reaction Details
TargetBeta-carbonic anhydrase 1
LigandBDBM50216276
Substrate/Competitorn/a
Meas. Tech.ChEMBL_736723 (CHEMBL1695104)
Ki 850±n/a nM
Citation Davis, RAHofmann, AOsman, AHall, RAMühlschlegel, FAVullo, DInnocenti, ASupuran, CTPoulsen, SA Natural product-based phenols as novel probes for mycobacterial and fungal carbonic anhydrases. J Med Chem54:1682-92 (2011) 
 
Beta-carbonic anhydrase 1
Name:Beta-carbonic anhydrase 1
Type:Enzyme
Mol. Mass.:18186.06
Organism:Mycobacterium tuberculosis
Description:The recombinant GST-mtCA1 construct was cloned, expressed, and further purified from E. coli. The purified protein was used in inhibition assays.
Residue:163
BDBM50216276
NameBDBM50216276
Synonyms:(-)-dihydroguaiaretic acid CHEMBL375927
TypeSmall organic molecule
Emp. Form.C20H26O4
Mol. Mass.330.418
SMILESCOc1cc(C[C@@H](C)[C@H](C)Cc2ccc(O)c(OC)c2)ccc1O