Reaction Details
TargetBeta-carbonic anhydrase 1
LigandBDBM50339599
Substrate/Competitorn/a
Meas. Tech.ChEMBL_736723 (CHEMBL1695104)
Ki 1270±n/a nM
Citation Davis, RAHofmann, AOsman, AHall, RAMühlschlegel, FAVullo, DInnocenti, ASupuran, CTPoulsen, SA Natural product-based phenols as novel probes for mycobacterial and fungal carbonic anhydrases. J Med Chem54:1682-92 (2011) 
 
Beta-carbonic anhydrase 1
Name:Beta-carbonic anhydrase 1
Type:Enzyme
Mol. Mass.:18186.06
Organism:Mycobacterium tuberculosis
Description:The recombinant GST-mtCA1 construct was cloned, expressed, and further purified from E. coli. The purified protein was used in inhibition assays.
Residue:163
BDBM50339599
NameBDBM50339599
Synonyms:2-(3-chloro-4-hydroxyphenyl)-N-(3-methoxyphenethyl)acetamide | CHEMBL589606
TypeSmall organic molecule
Emp. Form.C17H18ClNO3
Mol. Mass.319.783
SMILESCOc1cccc(CCNC(=O)Cc2ccc(O)c(Cl)c2)c1