Reaction Details
TargetL-lactate dehydrogenase A chain
LigandBDBM23222
Substrate/Competitorn/a
Meas. Tech.ChEMBL_734826 (CHEMBL1692976)
Ki 138000±n/a nM
Citation Granchi, CRoy, SGiacomelli, CMacchia, MTuccinardi, TMartinelli, ALanza, MBetti, LGiannaccini, GLucacchini, AFunel, NLeón, LGGiovannetti, EPeters, GJPalchaudhuri, RCalvaresi, ECHergenrother, PJMinutolo, F Discovery of N-hydroxyindole-based inhibitors of human lactate dehydrogenase isoform A (LDH-A) as starvation agents against cancer cells. J Med Chem54:1599-612 (2011) 
 
L-lactate dehydrogenase A chain
Name:L-lactate dehydrogenase A chain
Type:Protein
Mol. Mass.:36694.85
Organism:Homo sapiens (Human)
Description:P00338::PDB Code: 4ajp
Residue:332
BDBM23222
NameBDBM23222
Synonyms:Oxalamic acid Oxamate, 3 carbamoylformic acid
TypeSmall organic molecule
Emp. Form.C2H3NO3
Mol. Mass.89.0501
SMILESNC(=O)C(O)=O