Reaction Details
TargetL-lactate dehydrogenase A chain
LigandBDBM50339606
Substrate/Competitorn/a
Meas. Tech.ChEMBL_734829 (CHEMBL1692979)
Ki 19800±n/a nM
Citation Granchi, CRoy, SGiacomelli, CMacchia, MTuccinardi, TMartinelli, ALanza, MBetti, LGiannaccini, GLucacchini, AFunel, NLeón, LGGiovannetti, EPeters, GJPalchaudhuri, RCalvaresi, ECHergenrother, PJMinutolo, F Discovery of N-hydroxyindole-based inhibitors of human lactate dehydrogenase isoform A (LDH-A) as starvation agents against cancer cells. J Med Chem54:1599-612 (2011) 
 
L-lactate dehydrogenase A chain
Name:L-lactate dehydrogenase A chain
Type:Protein
Mol. Mass.:36694.85
Organism:Homo sapiens (Human)
Description:P00338::PDB Code: 4ajp
Residue:332
BDBM50339606
NameBDBM50339606
Synonyms:1-Hydroxy-6-phenyl-1H-indole-2-carboxylic Acid | CHEMBL1688789
TypeSmall organic molecule
Emp. Form.C15H11NO3
Mol. Mass.253.2527
SMILESOC(=O)c1cc2ccc(cc2n1O)-c1ccccc1