Reaction Details
TargetProstaglandin D2 receptor 2
LigandBDBM50339748
Substrate/Competitorn/a
Meas. Tech.ChEMBL_735525 (CHEMBL1693030)
IC50 0.50±n/a nM
Citation Luker, TBonnert, RPaine, SWSchmidt, JSargent, CCook, ARCook, AGardiner, PHill, SWeyman-Jones, CPatel, AThom, SThorne, P Zwitterionic CRTh2 antagonists. J Med Chem54:1779-88 (2011) 
 
Prostaglandin D2 receptor 2
Name:Prostaglandin D2 receptor 2
Type:Enzyme
Mol. Mass.:43295.45
Organism:Homo sapiens (Human)
Description:Q9Y5Y4
Residue:395
BDBM50339748
NameBDBM50339748
Synonyms:CHEMBL1689128 | [4-Chloro-2-[[(3S)-4-[(4-chlorophenyl)acetyl]-3-methyl-1-piperazinyl]methyl]phenoxy]acetic Acid
TypeSmall organic molecule
Emp. Form.C22H24Cl2N2O4
Mol. Mass.451.343
SMILESC[C@H]1CN(Cc2cc(Cl)ccc2OCC(O)=O)CCN1C(=O)Cc1ccc(Cl)cc1