Reaction Details
TargetProstaglandin D2 receptor 2
LigandBDBM50339758
Substrate/Competitorn/a
Meas. Tech.ChEMBL_735525 (CHEMBL1693030)
IC50 6±n/a nM
Citation Luker, TBonnert, RPaine, SWSchmidt, JSargent, CCook, ARCook, AGardiner, PHill, SWeyman-Jones, CPatel, AThom, SThorne, P Zwitterionic CRTh2 antagonists. J Med Chem54:1779-88 (2011) 
 
Prostaglandin D2 receptor 2
Name:Prostaglandin D2 receptor 2
Type:Enzyme
Mol. Mass.:43295.45
Organism:Homo sapiens (Human)
Description:Q9Y5Y4
Residue:395
BDBM50339758
NameBDBM50339758
Synonyms:2-(2-((4-(benzylsulfonyl)piperazin-1-yl)methyl)-4-chlorophenoxy)acetic acid | CHEMBL1689111
TypeSmall organic molecule
Emp. Form.C20H23ClN2O5S
Mol. Mass.438.925
SMILESOC(=O)COc1ccc(Cl)cc1CN1CCN(CC1)S(=O)(=O)Cc1ccccc1