Reaction Details
TargetProstaglandin D2 receptor 2
LigandBDBM50339750
Substrate/Competitorn/a
Meas. Tech.ChEMBL_735525 (CHEMBL1693030)
IC50 4.5±n/a nM
Citation Luker, TBonnert, RPaine, SWSchmidt, JSargent, CCook, ARCook, AGardiner, PHill, SWeyman-Jones, CPatel, AThom, SThorne, P Zwitterionic CRTh2 antagonists. J Med Chem54:1779-88 (2011) 
 
Prostaglandin D2 receptor 2
Name:Prostaglandin D2 receptor 2
Type:Enzyme
Mol. Mass.:43295.45
Organism:Homo sapiens (Human)
Description:Q9Y5Y4
Residue:395
BDBM50339750
NameBDBM50339750
Synonyms:(S)-2-(4-chloro-2-((3-methyl-4-(phenylsulfonyl)piperazin-1-yl)methyl)phenoxy)acetic acid | CHEMBL1689119
TypeSmall organic molecule
Emp. Form.C20H23ClN2O5S
Mol. Mass.438.925
SMILESC[C@H]1CN(Cc2cc(Cl)ccc2OCC(O)=O)CCN1S(=O)(=O)c1ccccc1