Reaction Details
TargetProstaglandin D2 receptor 2
LigandBDBM50339760
Substrate/Competitorn/a
Meas. Tech.ChEMBL_735525 (CHEMBL1693030)
IC50 10±n/a nM
Citation Luker, TBonnert, RPaine, SWSchmidt, JSargent, CCook, ARCook, AGardiner, PHill, SWeyman-Jones, CPatel, AThom, SThorne, P Zwitterionic CRTh2 antagonists. J Med Chem54:1779-88 (2011) 
 
Prostaglandin D2 receptor 2
Name:Prostaglandin D2 receptor 2
Type:Enzyme
Mol. Mass.:43295.45
Organism:Homo sapiens (Human)
Description:Q9Y5Y4
Residue:395
BDBM50339760
NameBDBM50339760
Synonyms:2-(4-chloro-2-((4-(4-fluorophenylsulfonyl)piperazin-1-yl)methyl)phenoxy)acetic acid | CHEMBL1689117
TypeSmall organic molecule
Emp. Form.C19H20ClFN2O5S
Mol. Mass.442.889
SMILESOC(=O)COc1ccc(Cl)cc1CN1CCN(CC1)S(=O)(=O)c1ccc(F)cc1