Reaction Details
TargetCarbonic anhydrase 12
LigandBDBM50334360
Substrate/Competitorn/a
Meas. Tech.ChEMBL_735542 (CHEMBL1693047)
Ki 4.6±n/a nM
Citation Pacchiano, FCarta, FMcDonald, PCLou, YVullo, DScozzafava, ADedhar, SSupuran, CT Ureido-substituted benzenesulfonamides potently inhibit carbonic anhydrase IX and show antimetastatic activity in a model of breast cancer metastasis. J Med Chem54:1896-902 (2011) 
 
Carbonic anhydrase 12
Name:Carbonic anhydrase 12
Type:Enzyme
Mol. Mass.:39456.00
Organism:Homo sapiens (Human)
Description:Catalytic domain of human cloned isozyme was used in the assay
Residue:354
BDBM50334360
NameBDBM50334360
Synonyms:4-(3-(4-acetylphenyl)ureido)benzenesulfonamide CA IX inhibitor, (C)2 | CHEMBL1643295
TypeSmall organic molecule
Emp. Form.C15H15N3O4S
Mol. Mass.333.362
SMILESCC(=O)c1ccc(NC(=O)Nc2ccc(cc2)S(N)(=O)=O)cc1