Reaction Details
TargetCarbonic anhydrase 2
LigandBDBM16654
Substrate/Competitorn/a
Meas. Tech.ChEMBL_735540 (CHEMBL1693045)
Ki 3730±n/a nM
Citation Pacchiano, FCarta, FMcDonald, PCLou, YVullo, DScozzafava, ADedhar, SSupuran, CT Ureido-substituted benzenesulfonamides potently inhibit carbonic anhydrase IX and show antimetastatic activity in a model of breast cancer metastasis. J Med Chem54:1896-902 (2011) 
 
Carbonic anhydrase 2
Name:Carbonic anhydrase 2
Type:Enzyme
Mol. Mass.:29250.71
Organism:Homo sapiens (Human)
Description:P00918
Residue:260
BDBM16654
NameBDBM16654
Synonyms:1-phenyl-3-(4-sulfamoylphenyl)urea | aromatic sulfonamide compound 19
TypeSmall organic molecule
Emp. Form.C13H13N3O3S
Mol. Mass.291.326
SMILESNS(=O)(=O)c1ccc(NC(=O)Nc2ccccc2)cc1