Reaction Details
TargetCarbonic anhydrase 9
LigandBDBM50334343
Substrate/Competitorn/a
Meas. Tech.ChEMBL_735541 (CHEMBL1693046)
Ki 41±n/a nM
Citation Pacchiano, FCarta, FMcDonald, PCLou, YVullo, DScozzafava, ADedhar, SSupuran, CT Ureido-substituted benzenesulfonamides potently inhibit carbonic anhydrase IX and show antimetastatic activity in a model of breast cancer metastasis. J Med Chem54:1896-902 (2011) 
 
Carbonic anhydrase 9
Name:Carbonic anhydrase 9
Type:Enzyme
Mol. Mass.:49669.03
Organism:Homo sapiens (Human)
Description:Catalytic domain of human cloned isozyme was used in the assay
Residue:459
BDBM50334343
NameBDBM50334343
Synonyms:4-(3-benzylureido)benzenesulfonamide CHEMBL1643289
TypeSmall organic molecule
Emp. Form.C14H15N3O3S
Mol. Mass.305.352
SMILESNS(=O)(=O)c1ccc(NC(=O)NCc2ccccc2)cc1