Reaction Details
TargetCarbonic anhydrase 2
LigandBDBM50334344
Substrate/Competitorn/a
Meas. Tech.ChEMBL_735540 (CHEMBL1693045)
Ki 3725±n/a nM
Citation Pacchiano, FCarta, FMcDonald, PCLou, YVullo, DScozzafava, ADedhar, SSupuran, CT Ureido-substituted benzenesulfonamides potently inhibit carbonic anhydrase IX and show antimetastatic activity in a model of breast cancer metastasis. J Med Chem54:1896-902 (2011) 
 
Carbonic anhydrase 2
Name:Carbonic anhydrase 2
Type:Enzyme
Mol. Mass.:29250.71
Organism:Homo sapiens (Human)
Description:P00918
Residue:260
BDBM50334344
NameBDBM50334344
Synonyms:4-(3-benzhydrylureido)benzenesulfonamide CHEMBL1643290
TypeSmall organic molecule
Emp. Form.C20H19N3O3S
Mol. Mass.381.448
SMILESNS(=O)(=O)c1ccc(NC(=O)NC(c2ccccc2)c2ccccc2)cc1