Reaction Details
TargetCarbonic anhydrase 1
LigandBDBM50334354
Substrate/Competitorn/a
Meas. Tech.ChEMBL_735539 (CHEMBL1693044)
Ki 5080±n/a nM
Citation Pacchiano, FCarta, FMcDonald, PCLou, YVullo, DScozzafava, ADedhar, SSupuran, CT Ureido-substituted benzenesulfonamides potently inhibit carbonic anhydrase IX and show antimetastatic activity in a model of breast cancer metastasis. J Med Chem54:1896-902 (2011) 
 
Carbonic anhydrase 1
Name:Carbonic anhydrase 1
Type:Enzyme
Mol. Mass.:28873.37
Organism:Homo sapiens (Human)
Description:P00915
Residue:261
BDBM50334354
NameBDBM50334354
Synonyms:4-(3-(4-fluorophenyl)ureido)benzenesulfonamide 4-{[(4-fluorophenyl)carbamoyl]amino}benzenesulfonamide | CHEMBL1615281
TypeSmall organic molecule
Emp. Form.C13H12FN3O3S
Mol. Mass.309.316
SMILESNS(=O)(=O)c1ccc(NC(=O)Nc2ccc(F)cc2)cc1