Reaction Details
TargetCarbonic anhydrase 2
LigandBDBM50334357
Substrate/Competitorn/a
Meas. Tech.ChEMBL_735540 (CHEMBL1693045)
Ki 1150±n/a nM
Citation Pacchiano, FCarta, FMcDonald, PCLou, YVullo, DScozzafava, ADedhar, SSupuran, CT Ureido-substituted benzenesulfonamides potently inhibit carbonic anhydrase IX and show antimetastatic activity in a model of breast cancer metastasis. J Med Chem54:1896-902 (2011) 
 
Carbonic anhydrase 2
Name:Carbonic anhydrase 2
Type:Enzyme
Mol. Mass.:29250.71
Organism:Homo sapiens (Human)
Description:P00918
Residue:260
BDBM50334357
NameBDBM50334357
Synonyms:4-(3-(4-(trifluoromethyl)phenyl)ureido)benzenesulfonamide CHEMBL1337519
TypeSmall organic molecule
Emp. Form.C14H12F3N3O3S
Mol. Mass.359.324
SMILESNS(=O)(=O)c1ccc(NC(=O)Nc2ccc(cc2)C(F)(F)F)cc1