Reaction Details
TargetCarbonic anhydrase 1
LigandBDBM50334358
Substrate/Competitorn/a
Meas. Tech.ChEMBL_735539 (CHEMBL1693044)
Ki 3690±n/a nM
Citation Pacchiano, FCarta, FMcDonald, PCLou, YVullo, DScozzafava, ADedhar, SSupuran, CT Ureido-substituted benzenesulfonamides potently inhibit carbonic anhydrase IX and show antimetastatic activity in a model of breast cancer metastasis. J Med Chem54:1896-902 (2011) 
 
Carbonic anhydrase 1
Name:Carbonic anhydrase 1
Type:Enzyme
Mol. Mass.:28873.37
Organism:Homo sapiens (Human)
Description:P00915
Residue:261
BDBM50334358
NameBDBM50334358
Synonyms:4-(3-(3,5-bis(trifluoromethyl)phenyl)ureido)benzenesulfonamide CHEMBL1643293
TypeSmall organic molecule
Emp. Form.C15H11F6N3O3S
Mol. Mass.427.322
SMILESNS(=O)(=O)c1ccc(NC(=O)Nc2cc(cc(c2)C(F)(F)F)C(F)(F)F)cc1