Reaction Details
TargetCarbonic anhydrase 2
LigandBDBM50334358
Substrate/Competitorn/a
Meas. Tech.ChEMBL_735540 (CHEMBL1693045)
Ki 75±n/a nM
Citation Pacchiano, FCarta, FMcDonald, PCLou, YVullo, DScozzafava, ADedhar, SSupuran, CT Ureido-substituted benzenesulfonamides potently inhibit carbonic anhydrase IX and show antimetastatic activity in a model of breast cancer metastasis. J Med Chem54:1896-902 (2011) 
 
Carbonic anhydrase 2
Name:Carbonic anhydrase 2
Type:Enzyme
Mol. Mass.:29250.71
Organism:Homo sapiens (Human)
Description:P00918
Residue:260
BDBM50334358
NameBDBM50334358
Synonyms:4-(3-(3,5-bis(trifluoromethyl)phenyl)ureido)benzenesulfonamide CHEMBL1643293
TypeSmall organic molecule
Emp. Form.C15H11F6N3O3S
Mol. Mass.427.322
SMILESNS(=O)(=O)c1ccc(NC(=O)Nc2cc(cc(c2)C(F)(F)F)C(F)(F)F)cc1