Reaction Details
TargetCarbonic anhydrase 9
LigandBDBM50334358
Substrate/Competitorn/a
Meas. Tech.ChEMBL_735541 (CHEMBL1693046)
Ki 53±n/a nM
Citation Pacchiano, FCarta, FMcDonald, PCLou, YVullo, DScozzafava, ADedhar, SSupuran, CT Ureido-substituted benzenesulfonamides potently inhibit carbonic anhydrase IX and show antimetastatic activity in a model of breast cancer metastasis. J Med Chem54:1896-902 (2011) 
 
Carbonic anhydrase 9
Name:Carbonic anhydrase 9
Type:Enzyme
Mol. Mass.:49669.03
Organism:Homo sapiens (Human)
Description:Catalytic domain of human cloned isozyme was used in the assay
Residue:459
BDBM50334358
NameBDBM50334358
Synonyms:4-(3-(3,5-bis(trifluoromethyl)phenyl)ureido)benzenesulfonamide CHEMBL1643293
TypeSmall organic molecule
Emp. Form.C15H11F6N3O3S
Mol. Mass.427.322
SMILESNS(=O)(=O)c1ccc(NC(=O)Nc2cc(cc(c2)C(F)(F)F)C(F)(F)F)cc1