Reaction Details
TargetCarbonic anhydrase 1
LigandBDBM50334350
Substrate/Competitorn/a
Meas. Tech.ChEMBL_735539 (CHEMBL1693044)
Ki 89±n/a nM
Citation Pacchiano, FCarta, FMcDonald, PCLou, YVullo, DScozzafava, ADedhar, SSupuran, CT Ureido-substituted benzenesulfonamides potently inhibit carbonic anhydrase IX and show antimetastatic activity in a model of breast cancer metastasis. J Med Chem54:1896-902 (2011) 
 
Carbonic anhydrase 1
Name:Carbonic anhydrase 1
Type:Enzyme
Mol. Mass.:28873.37
Organism:Homo sapiens (Human)
Description:P00915
Residue:261
BDBM50334350
NameBDBM50334350
Synonyms:4-(3-(4-methoxy-2-methylphenyl)ureido)benzenesulfonamide CHEMBL1643304
TypeSmall organic molecule
Emp. Form.C15H17N3O4S
Mol. Mass.335.378
SMILESCOc1ccc(NC(=O)Nc2ccc(cc2)S(N)(=O)=O)c(C)c1