Reaction Details
TargetCarbonic anhydrase 1
LigandBDBM50334351
Substrate/Competitorn/a
Meas. Tech.ChEMBL_735539 (CHEMBL1693044)
Ki 1700±n/a nM
Citation Pacchiano, FCarta, FMcDonald, PCLou, YVullo, DScozzafava, ADedhar, SSupuran, CT Ureido-substituted benzenesulfonamides potently inhibit carbonic anhydrase IX and show antimetastatic activity in a model of breast cancer metastasis. J Med Chem54:1896-902 (2011) 
 
Carbonic anhydrase 1
Name:Carbonic anhydrase 1
Type:Enzyme
Mol. Mass.:28873.37
Organism:Homo sapiens (Human)
Description:P00915
Residue:261
BDBM50334351
NameBDBM50334351
Synonyms:4-(3-9H-fluoren-2-ylureido)benzenesulfonamide CHEMBL1643305
TypeSmall organic molecule
Emp. Form.C20H17N3O3S
Mol. Mass.379.432
SMILESNS(=O)(=O)c1ccc(NC(=O)Nc2ccc-3c(Cc4ccccc-34)c2)cc1