Reaction Details
TargetCarbonic anhydrase 12
LigandBDBM50334352
Substrate/Competitorn/a
Meas. Tech.ChEMBL_735542 (CHEMBL1693047)
Ki 7±n/a nM
Citation Pacchiano, FCarta, FMcDonald, PCLou, YVullo, DScozzafava, ADedhar, SSupuran, CT Ureido-substituted benzenesulfonamides potently inhibit carbonic anhydrase IX and show antimetastatic activity in a model of breast cancer metastasis. J Med Chem54:1896-902 (2011) 
 
Carbonic anhydrase 12
Name:Carbonic anhydrase 12
Type:Enzyme
Mol. Mass.:39456.00
Organism:Homo sapiens (Human)
Description:Catalytic domain of human cloned isozyme was used in the assay
Residue:354
BDBM50334352
NameBDBM50334352
Synonyms:4-(3-cyclopentylureido)benzenesulfonamide CHEMBL1615215
TypeSmall organic molecule
Emp. Form.C12H17N3O3S
Mol. Mass.283.347
SMILESNS(=O)(=O)c1ccc(NC(=O)NC2CCCC2)cc1