Reaction Details
TargetCarbonic anhydrase 2
LigandBDBM50334345
Substrate/Competitorn/a
Meas. Tech.ChEMBL_735540 (CHEMBL1693045)
Ki 65±n/a nM
Citation Pacchiano, FCarta, FMcDonald, PCLou, YVullo, DScozzafava, ADedhar, SSupuran, CT Ureido-substituted benzenesulfonamides potently inhibit carbonic anhydrase IX and show antimetastatic activity in a model of breast cancer metastasis. J Med Chem54:1896-902 (2011) 
 
Carbonic anhydrase 2
Name:Carbonic anhydrase 2
Type:Enzyme
Mol. Mass.:29250.71
Organism:Homo sapiens (Human)
Description:P00918
Residue:260
BDBM50334345
NameBDBM50334345
Synonyms:4-(3-(4-cyanophenyl)ureido)benzenesulfonamide CHEMBL1643300
TypeSmall organic molecule
Emp. Form.C14H12N4O3S
Mol. Mass.316.335
SMILESNS(=O)(=O)c1ccc(NC(=O)Nc2ccc(cc2)C#N)cc1