Reaction Details
TargetM1 family aminopeptidase
LigandBDBM23971
Substrate/Competitorn/a
Meas. Tech.ChEMBL_735637 (CHEMBL1693339)
Ki 190±n/a nM
Citation Velmourougane, GHarbut, MBDalal, SMcGowan, SOellig, CAMeinhardt, NWhisstock, JCKlemba, MGreenbaum, DC Synthesis of new (-)-bestatin-based inhibitor libraries reveals a novel binding mode in the S1 pocket of the essential malaria M1 metalloaminopeptidase. J Med Chem54:1655-66 (2011) 
 
M1 family aminopeptidase
Name:M1 family aminopeptidase
Type:PROTEIN
Mol. Mass.:126072.31
Organism:Plasmodium falciparum (isolate FcB1 / Columbia)
Description:ChEMBL_735637
Residue:1085
BDBM23971
NameBDBM23971
Synonyms:(2S)-2-[(2S,3R)-3-amino-2-hydroxy-4-phenylbutanamido]-4-methylpentanoic acid CHEMBL29292 | Ubenimex
TypeSmall organic molecule
Emp. Form.C16H24N2O4
Mol. Mass.308.3728
SMILESCC(C)C[C@H](NC(=O)[C@@H](O)[C@H](N)Cc1ccccc1)C(O)=O