Reaction Details
TargetSerine/threonine-protein kinase PLK1
LigandBDBM28216
Substrate/Competitorn/a
Meas. Tech.ChEMBL_735641 (CHEMBL1693343)
IC50<9±n/a nM
Citation Solanki, SInnocenti, PMas-Droux, CBoxall, KBarillari, Cvan Montfort, RLAherne, GWBayliss, RHoelder, S Benzimidazole inhibitors induce a DFG-out conformation of never in mitosis gene A-related kinase 2 (Nek2) without binding to the back pocket and reveal a nonlinear structure-activity relationship. J Med Chem54:1626-39 (2011) 
 
Serine/threonine-protein kinase PLK1
Name:Serine/threonine-protein kinase PLK1
Type:Serine/threonine-protein kinase
Mol. Mass.:68277.16
Organism:Homo sapiens (Human)
Description:P53350
Residue:603
BDBM28216
NameBDBM28216
Synonyms:5-{6-[(1-methylpiperidin-4-yl)oxy]-1H-1,3-benzodiazol-1-yl}-3-[(1R)-1-[2-(trifluoromethyl)phenyl]ethoxy]thiophene-2-carboxamide | benzimidazole thiophene carboxamide, 24
TypeSmall organic molecule
Emp. Form.C27H27F3N4O3S
Mol. Mass.544.588
SMILESC[C@@H](Oc1cc(sc1C(N)=O)-n1cnc2ccc(OC3CCN(C)CC3)cc12)c1ccccc1C(F)(F)F