Reaction Details
TargetSerine/threonine-protein kinase Nek2
LigandBDBM50339799
Substrate/Competitorn/a
Meas. Tech.ChEMBL_735640 (CHEMBL1693342)
IC50 660±n/a nM
Citation Solanki, SInnocenti, PMas-Droux, CBoxall, KBarillari, Cvan Montfort, RLAherne, GWBayliss, RHoelder, S Benzimidazole inhibitors induce a DFG-out conformation of never in mitosis gene A-related kinase 2 (Nek2) without binding to the back pocket and reveal a nonlinear structure-activity relationship. J Med Chem54:1626-39 (2011) 
 
Serine/threonine-protein kinase Nek2
Name:Serine/threonine-protein kinase Nek2
Type:Enzyme
Mol. Mass.:51776.96
Organism:Homo sapiens (Human)
Description:P51955
Residue:445
BDBM50339799
NameBDBM50339799
Synonyms:(+/-)-4-(6-(1-Methylpiperidin-4-yloxy)-1H-benzo[d]imidazol-1-yl)-2-(1-(2-(trifluoromethyl)phenyl)ethoxy)benzamide | CHEMBL1689164
TypeSmall organic molecule
Emp. Form.C29H29F3N4O3
Mol. Mass.538.5608
SMILESCC(Oc1cc(ccc1C(N)=O)-n1cnc2ccc(OC3CCN(C)CC3)cc12)c1ccccc1C(F)(F)F